PFR,Accession,Description,Proteoform Sequence,Isoform Sequence,Length,Start,End,Monoisotopic Mass,Average Mass,PTMs,Sequence Modifications,N-Terminal Set,N-Terminal Id,C-Terminal Set,C-Terminal Id,Star
8643,O08997,Copper transport protein ATOX1,PKHEFSVDMTCEGCAEAVSRVLNKLGGVEFNIDLPNKKVCIDSEHSSDTLLATLNKTGKAVSYLGPK,MPKHEFSVDMTCEGCAEAVSRVLNKLGGVEFNIDLPNKKVCIDSEHSSDTLLATLNKTGKAVSYLGPK,67,1,67,7202.61877469,7207.23358,,,,,,,1
8654,Q62425,Cytochrome c oxidase subunit NDUFA4,MLRQILGQAKKHPSLIPLFVFIGAGGTGAALYVMRLALFNPDVSWDRKNNPEPWNKLGPNEQYKFYSVNVDYSKLKKEGPDF,MLRQILGQAKKHPSLIPLFVFIGAGGTGAALYVMRLALFNPDVSWDRKNNPEPWNKLGPNEQYKFYSVNVDYSKLKKEGPDF,82,0,81,9320.86796469,9326.79398,,,,,,,1
8655,Q9D3D9,ATP synthase subunit delta; mitochondrial,AEAAAAPAPAAGPGQMSFTFASPTQVFFDSANVKQVDVPTLTGAFGILASHVPTLQVLRPGLVVVHTEDGTTTKYFVSSGSVTVNADSSVQLLAEEAVTLDMLDLGAARANLEKAQSELSGAADEAARAEIQIRIEANEALVKALE,MLPASLLRHPGLRRLMLQARTYAEAAAAPAPAAGPGQMSFTFASPTQVFFDSANVKQVDVPTLTGAFGILASHVPTLQVLRPGLVVVHTEDGTTTKYFVSSGSVTVNADSSVQLLAEEAVTLDMLDLGAARANLEKAQSELSGAADEAARAEIQIRIEANEALVKALE,146,22,167,15014.68675469,15023.87158,,,,,,,1
8665,P34884,Macrophage migration inhibitory factor,PMFIVNTNVPRASVPEGFLSELTQQLAQATGKPAQYIAVHVVPDQLMTFSGTNDPCALCSLHSIGKIGGAQNRNYSKLLCGLLSDRLHISPDRVYINYYDMNAANVGWNGSTFA,MPMFIVNTNVPRASVPEGFLSELTQQLAQATGKPAQYIAVHVVPDQLMTFSGTNDPCALCSLHSIGKIGGAQNRNYSKLLCGLLSDRLHISPDRVYINYYDMNAANVGWNGSTFA,114,1,114,12365.13719469,12373.07408,,,,,,,1
8682,P56382,ATP synthase subunit epsilon; mitochondrial,VAYWRQAGLSYIRFSQICAKAVRDALKTEFKANAEKTSGSSIKIVKVSKKE,MVAYWRQAGLSYIRFSQICAKAVRDALKTEFKANAEKTSGSSIKIVKVSKKE,51,1,51,5703.10858469,5706.64968,,,,,,,1
8684,Q78IK2,Up-regulated during skeletal muscle growth protein 5,AGAESDGQFQFTGIKKYFNSYTLTGRMNCVLATYGGIALLVLYFKLRPKKTPAVKAT,MAGAESDGQFQFTGIKKYFNSYTLTGRMNCVLATYGGIALLVLYFKLRPKKTPAVKAT,57,1,57,6246.31652469,6250.32738,,,,,,,1
8707,P56379,6.8 kDa mitochondrial proteolipid,MFQTLIQKVWVPMKPYYTQVYQEIWVGVGLMSLIVYKIRSADKRSKALKGPAPAHGHH,MFQTLIQKVWVPMKPYYTQVYQEIWVGVGLMSLIVYKIRSADKRSKALKGPAPAHGHH,58,0,57,6693.58465469,6697.97508,,,,,,,1
8713,Q9CPU2,NADH dehydrogenase [ubiquinone] 1 beta subcomplex subunit 2; mitochondrial,AGGGVHIQPRYREFPQLTRSQVIQGEFLSSLMWFWILWRFWHDSDAVLGHFSYPDPSQWTDEELGIPPDDED,MSALTRLVPFGRVGGRLLRGCRARAAGDSGVRHAGGGVHIQPRYREFPQLTRSQVIQGEFLSSLMWFWILWRFWHDSDAVLGHFSYPDPSQWTDEELGIPPDDED,72,33,104,8486.04482469,8491.37378,,,,,,,1
8718,P48771,Cytochrome c oxidase subunit 7A2; mitochondrial,FENKVPEKQKLFQEDNGMPVHLKGGASDALLYRATMALTLGGTAYAIYLLAMAAFPKKQN,MLRNLLALRQIAQRTISTTSRRHFENKVPEKQKLFQEDNGMPVHLKGGASDALLYRATMALTLGGTAYAIYLLAMAAFPKKQN,60,23,82,6568.41121469,6572.66338,,,,,,,1
8741,Q06185,ATP synthase subunit e; mitochondrial,VPPVQVSPLIKFGRYSALIIGMAYGAKRYSYLKPRAEEERRIAAEEKKRLDELKRIERELAEAQDDSILK,MVPPVQVSPLIKFGRYSALIIGMAYGAKRYSYLKPRAEEERRIAAEEKKRLDELKRIERELAEAQDDSILK,70,1,70,8099.42610469,8104.40958,,,,,,,1
8803,P56393,Cytochrome c oxidase subunit 7B; mitochondrial,SHQKRAPSFHDKYGNAILAGGAIFCVSTWTYTATQIGIEWNMSPVGRVTPKEWRDQ,MLPLAKNALSRLQVRSIQQVVARQSHQKRAPSFHDKYGNAILAGGAIFCVSTWTYTATQIGIEWNMSPVGRVTPKEWRDQ,56,24,79,6305.11152469,6309.10308,,,,,,,1
8814,P34884,Macrophage migration inhibitory factor,PMFIVNTNVPRASVPEGFLSELTQQLAQATGKPAQYIAVHVVPDQLMTFSGTNDPCALCSLHSIGKIGGAQNRNYSKLLCGLLSDRLHISPDRVYINYYDMNAANVGWNGSTFA,MPMFIVNTNVPRASVPEGFLSELTQQLAQATGKPAQYIAVHVVPDQLMTFSGTNDPCALCSLHSIGKIGGAQNRNYSKLLCGLLSDRLHISPDRVYINYYDMNAANVGWNGSTFA,114,1,114,12407.14775969,12415.11408,RESID:55@76,,,,,,1
8873,P17665,Cytochrome c oxidase subunit 7C; mitochondrial,SHYEEGPGKNLPFSVENKWRLLAMMTVYFGSGFAAPFFIVRHQLLKK,MLGQSIRRFTTSVVRRSHYEEGPGKNLPFSVENKWRLLAMMTVYFGSGFAAPFFIVRHQLLKK,47,16,62,5439.82046469,5443.37508,,,,,,,1
8885,Q9CQ69,Cytochrome b-c1 complex subunit 8,GREFGNLARIRHVISYSLSPFEQRAFPSYFSKGIPNVLRRTRERILRVAPPFVVVYLIYTWGNQEFEQSKRKNPAMYENDK,MGREFGNLARIRHVISYSLSPFEQRAFPSYFSKGIPNVLRRTRERILRVAPPFVVVYLIYTWGNQEFEQSKRKNPAMYENDK,81,1,81,9631.06963468999,9637.05788,,,,,,,1
8899,P43024,Cytochrome c oxidase subunit 6A1; mitochondrial,SSGAHGEEGSARMWKALTYFVALPGVGVSMLNVFLKSRHEEHERPPFVAYPHLRIRTKPFPWGDGNHTLFHNPHVNPLPTGYEDE,MASAVLSASRVSRPLGRALPGLRRPMSSGAHGEEGSARMWKALTYFVALPGVGVSMLNVFLKSRHEEHERPPFVAYPHLRIRTKPFPWGDGNHTLFHNPHVNPLPTGYEDE,85,26,110,9613.77461468999,9619.82798,,,,,,,1
8913,Q64445,Cytochrome c oxidase subunit 8A; mitochondrial,VHSKPAREQLGVLDITIGLTSCFVCCLLPAGWVLSHLESYKKRE,MSVLTPLLLRSLTGSARRLMVPRAQVHSKPAREQLGVLDITIGLTSCFVCCLLPAGWVLSHLESYKKRE,44,25,68,4895.56517469,4898.77748,,,,,,,1
8959,Q9CPX8,Cytochrome b-c1 complex subunit 10,MLSRFLGPRYRELARNWIPTAGMWGTVGAVGLVWATDWRLILDWVPYINGKFKKDD,MLSRFLGPRYRELARNWIPTAGMWGTVGAVGLVWATDWRLILDWVPYINGKFKKDD,56,0,55,6534.41894469,6538.64418,,,,,,,1
8991,P12787,Cytochrome c oxidase subunit 5A; mitochondrial,SHGSHETDEEFDARWVTYFNKPDIDAWELRKGMNTLVGYDLVPEPKIIDAALRACRRLNDFASAVRILEVVKDKAGPHKEIYPYVIQELRPTLNELGISTPEELGLDKV,MLAAALRRCTAAAAARGLLHPASAPSPAAAVCSIRCYSHGSHETDEEFDARWVTYFNKPDIDAWELRKGMNTLVGYDLVPEPKIIDAALRACRRLNDFASAVRILEVVKDKAGPHKEIYPYVIQELRPTLNELGISTPEELGLDKV,109,37,145,12428.38972469,12436.10218,,,,,,,1
9082,Q06185,ATP synthase subunit e; mitochondrial,MVPPVQVSPLIKFGRYSALIIGMAYGAKRYSYLKPRAEEERRIAAEEKKRLDELKRIERELAEAQDDSILK,MVPPVQVSPLIKFGRYSALIIGMAYGAKRYSYLKPRAEEERRIAAEEKKRLDELKRIERELAEAQDDSILK,71,0,70,8230.46659469,8235.60218,,,,,,,1
9480,Q9CPQ1,Cytochrome c oxidase subunit 6C,SSGALLPKPQMRGLLAKRLRVHIAGAFIVALGVAAAYKFGVAEPRKKAYAEFYRNYDSMKDFEEMRKAGIFQSAK,MSSGALLPKPQMRGLLAKRLRVHIAGAFIVALGVAAAYKFGVAEPRKKAYAEFYRNYDSMKDFEEMRKAGIFQSAK,75,1,75,8332.46475469,8337.80708,,,,,,,1
9583,Q9D173,Mitochondrial import receptor subunit TOM7 homolog,VKLSKEAKQRLQQLFKGGQFAIRWGFIPLVIYLGFTRGADPGMPEPSVLSLLWG,MVKLSKEAKQRLQQLFKGGQFAIRWGFIPLVIYLGFTRGADPGMPEPSVLSLLWG,54,1,54,6042.32250469,6046.17538,,,,,,,1
10124,Q9CQY9,NADH dehydrogenase [ubiquinone] 1 subunit C1; mitochondrial,KFYVREPVNAKPNWLAVGLSVGASVFMWIYLIQTHNEDVLEYKRRNGLE,MAPSVVLRSFSRLLAPARLPSCSSTRSKFYVREPVNAKPNWLAVGLSVGASVFMWIYLIQTHNEDVLEYKRRNGLE,49,27,75,5749.00305469,5752.63628,,,,,,,1
10155,Q78IK2,Up-regulated during skeletal muscle growth protein 5,MAGAESDGQFQFTGIKKYFNSYTLTGRMNCVLATYGGIALLVLYFKLRPKKTPAVKAT,MAGAESDGQFQFTGIKKYFNSYTLTGRMNCVLATYGGIALLVLYFKLRPKKTPAVKAT,58,0,57,6377.35701469,6381.51998,,,,,,,1
10348,P10853,Histone H2B type 1-F/J/L,PEPAKSAPAPKKGSKKAVTKAQKKDGKKRKRSRKESYSVYVYKVLKQVHPDTGISSKAMGIMNSFVNDIFERIASEASRLAHYNKRSTITSREIQTAVRLLLPGELAKHAVSEGTKAVTKYTSSK,MPEPAKSAPAPKKGSKKAVTKAQKKDGKKRKRSRKESYSVYVYKVLKQVHPDTGISSKAMGIMNSFVNDIFERIASEASRLAHYNKRSTITSREIQTAVRLLLPGELAKHAVSEGTKAVTKYTSSK,125,1,125,13796.52735469,13804.97278,,,,,,,1
11972,P62984,Ubiquitin-60S ribosomal protein L40,MQIFVKTLTGKTITLEVEPSDTIENVKAKIQDKEGIPPDQQRLIFAGKQLEDGRTLSDYNIQKESTLHLVLRLRGG,MQIFVKTLTGKTITLEVEPSDTIENVKAKIQDKEGIPPDQQRLIFAGKQLEDGRTLSDYNIQKESTLHLVLRLRGGIIEPSLRQLAQKYNCDKMICRKCYARLHPRAVNCRKKKCGHTNNLRPKKKVK,76,0,75,8559.61656469,8564.84488,,,,,,,1
11983,P62984,Ubiquitin-60S ribosomal protein L40,QIFVKTLTGKTITLEVEPSDTIENVKAKIQDKEGIPPDQQRLIFAGKQLEDGRTLSDYNIQKESTLHLVLRLRGG,MQIFVKTLTGKTITLEVEPSDTIENVKAKIQDKEGIPPDQQRLIFAGKQLEDGRTLSDYNIQKESTLHLVLRLRGGIIEPSLRQLAQKYNCDKMICRKCYARLHPRAVNCRKKKCGHTNNLRPKKKVK,75,1,75,8428.57607469,8433.65228,,,,,,,1
12011,Q6ZWY9,Histone H2B type 1-C/E/G,PEPAKSAPAPKKGSKKAVTKAQKKDGKKRKRSRKESYSVYVYKVLKQVHPDTGISSKAMGIMNSFVNDIFERIAGEASRLAHYNKRSTITSREIQTAVRLLLPGELAKHAVSEGTKAVTKYTSSK,MPEPAKSAPAPKKGSKKAVTKAQKKDGKKRKRSRKESYSVYVYKVLKQVHPDTGISSKAMGIMNSFVNDIFERIAGEASRLAHYNKRSTITSREIQTAVRLLLPGELAKHAVSEGTKAVTKYTSSK,125,1,125,13766.51678469,13774.94648,,,,,,,1
22371,Q8R1I1,Cytochrome b-c1 complex subunit 9,SSPTIPSRLYSLLFRRTSTFALTIAVGALFFERAFDQGADAIYEHINEGKLWKHIKHKYENKE,MSSPTIPSRLYSLLFRRTSTFALTIAVGALFFERAFDQGADAIYEHINEGKLWKHIKHKYENKE,63,1,63,7351.83621969,7356.37558,,,PSI-MOD,1458,,,1
22372,Q8R1I1,Cytochrome b-c1 complex subunit 9,SSPTIPSRLYSLLFRRTSTFALTIAVGALFFERAFDQGADAIYEHINEGKLWKHIKHKYENKE,MSSPTIPSRLYSLLFRRTSTFALTIAVGALFFERAFDQGADAIYEHINEGKLWKHIKHKYENKE,63,1,63,7309.82565469,7314.33558,,,,,,,1
22373,Q7TNS2,MICOS complex subunit Mic10,SESELGRKWDRCMADTVVKLGTGFGLGIVFSLTFFKRRMWPLAFGSGVGLGMAYSNCQHDFQAPYLLHGKYVKEQ,MSESELGRKWDRCMADTVVKLGTGFGLGIVFSLTFFKRRMWPLAFGSGVGLGMAYSNCQHDFQAPYLLHGKYVKEQ,75,1,75,8472.21470969,8477.80708,,,PSI-MOD,1458,,,1
22374,Q64433,10 kDa heat shock protein; mitochondrial,AGQAFRKFLPLFDRVLVERSAAETVTKGGIMLPEKSQGKVLQATVVAVGSGGKGKSGEIEPVSVKVGDKVLLPEYGGTKVVLDDKDYFLFRDSDILGKYVD,MAGQAFRKFLPLFDRVLVERSAAETVTKGGIMLPEKSQGKVLQATVVAVGSGGKGKSGEIEPVSVKVGDKVLLPEYGGTKVVLDDKDYFLFRDSDILGKYVD,101,1,101,10866.83555969,10873.55038,RESID:55@6,,,,,,1
22375,P26350,Prothymosin alpha,SDAAVDTSSEITTKDLKEKKEVVEEAENGRDAPANGNAQNEENGEQEADNEVDEEEEEGGEEEEEEEEGDGEEEDGDEDEEAEAPTGKRVAEDDEDDDVDTKKQKTEEDD,MSDAAVDTSSEITTKDLKEKKEVVEEAENGRDAPANGNAQNEENGEQEADNEVDEEEEEGGEEEEEEEEGDGEEEDGDEDEEAEAPTGKRVAEDDEDDDVDTKKQKTEEDD,110,1,110,12158.02242969,12164.94338,,,PSI-MOD,1458,,,1
22376,Q9CQX8,28S ribosomal protein S36; mitochondrial,GSKMASATRVVQVVKPHAPLIKFPNRRDKPKLSASEALGSAALPSHSSAISQHSKGSTSPDLLMHQGPPDTAEIIKSLPQKYRRKPMSQEEMEFIQRGGPE,MGSKMASATRVVQVVKPHAPLIKFPNRRDKPKLSASEALGSAALPSHSSAISQHSKGSTSPDLLMHQGPPDTAEIIKSLPQKYRRKPMSQEEMEFIQRGGPE,101,1,101,11004.72787969,11011.61558,,,PSI-MOD,1458,,,1
22377,Q64433,10 kDa heat shock protein; mitochondrial,AGQAFRKFLPLFDRVLVERSAAETVTKGGIMLPEKSQGKVLQATVVAVGSGGKGKSGEIEPVSVKVGDKVLLPEYGGTKVVLDDKDYFLFRDSDILGKYVD,MAGQAFRKFLPLFDRVLVERSAAETVTKGGIMLPEKSQGKVLQATVVAVGSGGKGKSGEIEPVSVKVGDKVLLPEYGGTKVVLDDKDYFLFRDSDILGKYVD,101,1,101,10866.83555969,10873.55038,,,PSI-MOD,1458,,,1
22378,Q9CPQ8,ATP synthase subunit g; mitochondrial,AKFIRNFAEKAPSMVAAAVTYSKPRLATFWHYAKVELVPPTPAEIPTAIQSVKKIIQSAKTGSFKHLTVKEAVLNGLVATEVWMWFYIGEIIGKRGIVGYDV,MAKFIRNFAEKAPSMVAAAVTYSKPRLATFWHYAKVELVPPTPAEIPTAIQSVKKIIQSAKTGSFKHLTVKEAVLNGLVATEVWMWFYIGEIIGKRGIVGYDV,102,1,102,11328.14266969,11335.35628,,,PSI-MOD,1458,,,1
22383,Q9CPQ1,Cytochrome c oxidase subunit 6C,SSGALLPKPQMRGLLAKRLRVHIAGAFIVALGVAAAYKFGVAEPRKKAYAEFYRNYDSMKDFEEMRKAGIFQSAK,MSSGALLPKPQMRGLLAKRLRVHIAGAFIVALGVAAAYKFGVAEPRKKAYAEFYRNYDSMKDFEEMRKAGIFQSAK,75,1,75,8374.47531969,8379.84708,,,PSI-MOD,1458,,,1
22385,P26350,Prothymosin alpha,SDAAVDTSSEITTKDLKEKKEVVEEAENGRDAPANGNAQNEENGEQEADNEVDEEEEEGGEEEEEEEEGDGEEEDGDEDEEAEAPTGKRVAEDDEDDDVDTKKQKTEEDD,MSDAAVDTSSEITTKDLKEKKEVVEEAENGRDAPANGNAQNEENGEQEADNEVDEEEEEGGEEEEEEEEGDGEEEDGDEDEEAEAPTGKRVAEDDEDDDVDTKKQKTEEDD,110,1,110,12158.02242969,12164.94338,RESID:55@13,,,,,,1
22387,Q9D0J8,Parathymosin,SEKSVEAAAELSAKDLKEKKDKVEEKAGRKERKKEVVEEEENGAEEEEEETAEDGEDDDEGDEEDEEEEEEDEGPVRKRTAEEEDEADPKRQKTENGASA,MSEKSVEAAAELSAKDLKEKKDKVEEKAGRKERKKEVVEEEENGAEEEEEETAEDGEDDDEGDEEDEEEEEEDEGPVRKRTAEEEDEADPKRQKTENGASA,100,1,100,11334.11640969,11340.63298,RESID:55@2,,,,,,1
22390,P56391,Cytochrome c oxidase subunit 6B1,AEDIKTKIKNYKTAPFDSRFPNQNQTKNCWQNYLDFHRCEKAMTAKGGDVSVCEWYRRVYKSLCPVSWVSAWDDRIAEGTFPGKI,MAEDIKTKIKNYKTAPFDSRFPNQNQTKNCWQNYLDFHRCEKAMTAKGGDVSVCEWYRRVYKSLCPVSWVSAWDDRIAEGTFPGKI,85,1,85,9975.84856968999,9982.29958,,,PSI-MOD,1458,,,1
22391,Q9CQ91,NADH dehydrogenase [ubiquinone] 1 alpha subcomplex subunit 3,AGRISAFLKNAWAKEPVLVVSFSVWGLAIIMPMISPYTKYASMINKATPYNYPVPVRDDGNMPDVPSHPQDPLGPSLDWLKNL,MAGRISAFLKNAWAKEPVLVVSFSVWGLAIIMPMISPYTKYASMINKATPYNYPVPVRDDGNMPDVPSHPQDPLGPSLDWLKNL,83,1,83,9235.73073968999,9241.75878,,,PSI-MOD,1458,,,1
22393,P02088,Hemoglobin subunit beta-1,VHLTDAEKAAVSCLWGKVNSDEVGGEALGRLLVVYPWTQRYFDSFGDLSSASAIMGNAKVKAHGKKVITAFNDGLNHLDSLKGTFASLSELHCDKLHVDPENFRLLGNMIVIVLGHHLGKDFTPAAQAAFQKVVAGVATALAHKYH,MVHLTDAEKAAVSCLWGKVNSDEVGGEALGRLLVVYPWTQRYFDSFGDLSSASAIMGNAKVKAHGKKVITAFNDGLNHLDSLKGTFASLSELHCDKLHVDPENFRLLGNMIVIVLGHHLGKDFTPAAQAAFQKVVAGVATALAHKYH,146,1,146,15699.10680469,15708.98738,,,,,,,1
22395,P62858,40S ribosomal protein S28,MDTSRVQPIKLARVTKVLGRTGSQGQCTQVRVEFMDDTSRSIIRNVKGPVREGDVLTLLESEREARRLR,MDTSRVQPIKLARVTKVLGRTGSQGQCTQVRVEFMDDTSRSIIRNVKGPVREGDVLTLLESEREARRLR,69,0,68,7878.21185,7883.06668,,,PSI-MOD,1458,,,1
22398,Q62425,Cytochrome c oxidase subunit NDUFA4,MLRQILGQAKKHPSLIPLFVFIGAGGTGAALYVMRLALFNPDVSWDRKNNPEPWNKLGPNEQYKFYSVNVDYSKLKKEGPDF,MLRQILGQAKKHPSLIPLFVFIGAGGTGAALYVMRLALFNPDVSWDRKNNPEPWNKLGPNEQYKFYSVNVDYSKLKKEGPDF,82,0,81,9362.87852969,9368.83398,,,PSI-MOD,1458,,,1
22400,Q9DCX2,ATP synthase subunit d; mitochondrial,AGRKLALKTIDWVSFVEVMPQNQKAIGNALKSWNETFHARLASLSEKPPAIDWAYYRANVAKPGLVDDFEKKYNALKIPVPEDKYTALVDQEEKEDVKSCAEFVSGSQLRIQEYEKQLEKMRNIIPFDQMTIDDLNEIFPETKLDKKKYPYWPHQPIENL,MAGRKLALKTIDWVSFVEVMPQNQKAIGNALKSWNETFHARLASLSEKPPAIDWAYYRANVAKPGLVDDFEKKYNALKIPVPEDKYTALVDQEEKEDVKSCAEFVSGSQLRIQEYEKQLEKMRNIIPFDQMTIDDLNEIFPETKLDKKKYPYWPHQPIENL,160,1,160,18648.56302969,18660.30108,,,PSI-MOD,1458,,,1
22402,Q9CQX8,28S ribosomal protein S36; mitochondrial,MGSKMASATRVVQVVKPHAPLIKFPNRRDKPKLSASEALGSAALPSHSSAISQHSKGSTSPDLLMHQGPPDTAEIIKSLPQKYRRKPMSQEEMEFIQRGGPE,MGSKMASATRVVQVVKPHAPLIKFPNRRDKPKLSASEALGSAALPSHSSAISQHSKGSTSPDLLMHQGPPDTAEIIKSLPQKYRRKPMSQEEMEFIQRGGPE,102,0,101,11093.75780469,11100.76818,,,,,,,1
22403,Q9CR68,Cytochrome b-c1 complex subunit Rieske; mitochondrial,MLSVAARSGPFAPVLSATSRGVAGALRPLLQGAVPAASEPPVLDVKRPFLCRESLSGQAAARPLVATVGLNVPASVRF,MLSVAARSGPFAPVLSATSRGVAGALRPLLQGAVPAASEPPVLDVKRPFLCRESLSGQAAARPLVATVGLNVPASVRFSHTDVKVPDFSDYRRAEVLDSTKSSKESSEARKGFSYLVTATTTVGVAYAAKNVVSQFVSSMSASADVLAMSKIEIKLSDIPEGKNMAFKWRGKPLFVRHRTKKEIDQEAAVEVSQLRDPQHDLDRVKKPEWVILIGVCTHLGCVPIANAGDFGGYYCPCHGSHYDASGRIRKGPAPLNLEVPAYEFTSDDVVVVG,78,0,77,7929.35041969,7934.30858,,,PSI-MOD,1458,,,1
22404,Q9CPQ8,ATP synthase subunit g; mitochondrial,AKFIRNFAEKAPSMVAAAVTYSKPRLATFWHYAKVELVPPTPAEIPTAIQSVKKIIQSAKTGSFKHLTVKEAVLNGLVATEVWMWFYIGEIIGKRGIVGYDV,MAKFIRNFAEKAPSMVAAAVTYSKPRLATFWHYAKVELVPPTPAEIPTAIQSVKKIIQSAKTGSFKHLTVKEAVLNGLVATEVWMWFYIGEIIGKRGIVGYDV,102,1,102,11328.14266969,11335.35628,RESID:55@9,,,,,,1
22409,Q9Z1P6,NADH dehydrogenase [ubiquinone] 1 alpha subcomplex subunit 7,ASATRVIQKLRNWASGQDLQAKLQLRYQEIAKRTQPPPKLPVGPSHKLSNNYYCTRDGRREVVPPSIIMSSQKALVSGKAAESSAMAATEKKAVTPAPPMKRWELSKDQPYL,MASATRVIQKLRNWASGQDLQAKLQLRYQEIAKRTQPPPKLPVGPSHKLSNNYYCTRDGRREVVPPSIIMSSQKALVSGKAAESSAMAATEKKAVTPAPPMKRWELSKDQPYL,112,1,112,12478.60987969,12486.42798,,,PSI-MOD,1458,,,1
22411,P26350,Prothymosin alpha,SDAAVDTSSEITTKDLKEKKEVVEEAENGRDAPANGNAQNEENGEQEADNEVDEEEEEGGEEEEEEEEGDGEEEDGDEDEEAEAPTGKRVAEDDEDDDVDTKKQKTEEDD,MSDAAVDTSSEITTKDLKEKKEVVEEAENGRDAPANGNAQNEENGEQEADNEVDEEEEEGGEEEEEEEEGDGEEEDGDEDEEAEAPTGKRVAEDDEDDDVDTKKQKTEEDD,110,1,110,12317.95509169,12324.90338,RESID:38@11|RESID:38@12|RESID:55@13,,,,,,1
22412,P52760,Ribonuclease UK114,SSIIRKVISTTKAPAAIGPYSQAVQVDRTIYISGQVGLDPSSGQLVPGGVVEEAKQALKNLGEILKAAGCDFNNVVKTTVLLADMNDFGTVNEIYKTYFQGSLPARAAYQVAALPRGSRVEIEAIAVQGPFIKA,MSSIIRKVISTTKAPAAIGPYSQAVQVDRTIYISGQVGLDPSSGQLVPGGVVEEAKQALKNLGEILKAAGCDFNNVVKTTVLLADMNDFGTVNEIYKTYFQGSLPARAAYQVAALPRGSRVEIEAIAVQGPFIKA,134,1,134,14157.51853969,14166.26718,,,PSI-MOD,1458,,,1
22419,P62983,Ubiquitin-40S ribosomal protein S27a,MQIFVKTLTGKTITLEVEPSDTIENVKAKIQDKEGIPPDQQRLIFAGKQLEDGRTLSDYNIQKESTLHLVLRLRGG,MQIFVKTLTGKTITLEVEPSDTIENVKAKIQDKEGIPPDQQRLIFAGKQLEDGRTLSDYNIQKESTLHLVLRLRGGAKKRKKKSYTTPKKNKHKRKKVKLAVLKYYKVDENGKISRLRRECPSDECGAGVFMGSHFDRHYCGKCCLTYCFNKPEDK,76,0,75,8559.61656469,8564.84488,,,,,,,1
22420,P99027,60S acidic ribosomal protein P2,MRYVASYLLAALGGNSSPSAKDIKKILDSVGIEADDDRLNKVISELNGKNIEDVIAQGVGKLASVPAGGAVAVSAAPGSAAPAAGSAPAAAEEKKDEKKEESEESDDDMGFGLFD,MRYVASYLLAALGGNSSPSAKDIKKILDSVGIEADDDRLNKVISELNGKNIEDVIAQGVGKLASVPAGGAVAVSAAPGSAAPAAGSAPAAAEEKKDEKKEESEESDDDMGFGLFD,115,0,114,11803.76404669,11810.87028,RESID:37@101|RESID:37@104,,,,,,1
22425,P06797,Cathepsin L1,NKNKYWLVKNSWGSEWGMEGYIKIAKDRDNHCGLATAASYPVVN,MNLLLLLAVLCLGTALATPKFDQTFSAEWHQWKSTHRRLYGTNEEEWRRAIWEKNMRMIQLHNGEYSNGQHGFSMEMNAFGDMTNEEFRQVVNGYRHQKHKKGRLFQEPLMLKIPKSVDWREKGCVTPVKNQGQCGSCWAFSASGCLEGQMFLKTGKLISLSEQNLVDCSHAQGNQGCNGGLMDFAFQYIKENGGLDSEESYPYEAKDGSCKYRAEFAVANDTGFVDIPQQEKALMKAVATVGPISVAMDASHPSLQFYSSGIYYEPNCSSKNLDHGVLLVGYGYEGTDSNKNKYWLVKNSWGSEWGMEGYIKIAKDRDNHCGLATAASYPVVN,44,290,333,5012.44897469,5015.65518,,,,,,,1
22426,P62806,Histone H4,SGRGKGGKGLGKGGAKRHRKVLRDNIQGITKPAIRRLARRGGVKRISGLIYEETRGVLKVFLENVIRDAVTYTEHAKRKTVTAMDVVYALKRQGRTLYGFGG,MSGRGKGGKGLGKGGAKRHRKVLRDNIQGITKPAIRRLARRGGVKRISGLIYEETRGVLKVFLENVIRDAVTYTEHAKRKTVTAMDVVYALKRQGRTLYGFGG,102,1,102,11313.36214,11320.23188,RESID:55@7|RESID:55@11,,,,,,1
22427,O35683,NADH dehydrogenase [ubiquinone] 1 alpha subcomplex subunit 1,MWFEILPGLAIMGVCLVIPGVSTAYIHKFTNGGKEKRVARVQYQWYLMERDRRISGVNRYYVSKGLENID,MWFEILPGLAIMGVCLVIPGVSTAYIHKFTNGGKEKRVARVQYQWYLMERDRRISGVNRYYVSKGLENID,70,0,69,8133.23096469,8138.52548,,,,,,,1
22430,P62806,Histone H4,SGRGKGGKGLGKGGAKRHRKVLRDNIQGITKPAIRRLARRGGVKRISGLIYEETRGVLKVFLENVIRDAVTYTEHAKRKTVTAMDVVYALKRQGRTLYGFGG,MSGRGKGGKGLGKGGAKRHRKVLRDNIQGITKPAIRRLARRGGVKRISGLIYEETRGVLKVFLENVIRDAVTYTEHAKRKTVTAMDVVYALKRQGRTLYGFGG,102,1,102,11299.38287969,11306.24188,RESID:67@2|RESID:55@11,,,,,,1
22432,Q9CQR2,40S ribosomal protein S21,MQNDAGEFVDLYVPRKCSASNRIIAAKDHASIQMNVAEVDRTTGRFNGQFKTYGICGAIRRMGESDDSILRLAKADGIVSKNF,MQNDAGEFVDLYVPRKCSASNRIIAAKDHASIQMNVAEVDRTTGRFNGQFKTYGICGAIRRMGESDDSILRLAKADGIVSKNF,83,0,82,9177.56433969,9183.40168,,,PSI-MOD,1458,,,1
22434,Q91VW3,SH3 domain-binding glutamic acid-rich-like protein 3,SGLRVYSTSVTGSREIKSQQSEVTRILDGKRIQYQLVDISQDNALRDEMRTLAGNPKATPPQIVNGNHYCGDYELFVEAVEQDTLQEFLKLA,MSGLRVYSTSVTGSREIKSQQSEVTRILDGKRIQYQLVDISQDNALRDEMRTLAGNPKATPPQIVNGNHYCGDYELFVEAVEQDTLQEFLKLA,92,1,92,10381.24507969,10387.60058,,,PSI-MOD,1458,,,1
22435,Q8BT35,Uncharacterized protein LINC00116 homolog,ADVSERTLQVSVLVAFASGVVLGWQANRLRRRYLDWRKRRLQDKLATTQKKLDLA,MADVSERTLQVSVLVAFASGVVLGWQANRLRRRYLDWRKRRLQDKLATTQKKLDLA,55,1,55,6393.58895469,6397.44388,,,,,,,1
22441,P22752,Histone H2A type 1,SGRGKQGGKARAKAKTRSSRAGLQFPVGRVHRLLRKGNYSERVGAGAPVYLAAVLEYLTAEILELAGNAARDNKKTRIIPRHLQLAIRNDEELNKLLGRVTIAQGGVLPNIQAVLLPKKTESHHKAKGK,MSGRGKQGGKARAKAKTRSSRAGLQFPVGRVHRLLRKGNYSERVGAGAPVYLAAVLEYLTAEILELAGNAARDNKKTRIIPRHLQLAIRNDEELNKLLGRVTIAQGGVLPNIQAVLLPKKTESHHKAKGK,129,1,129,14037.91972,14046.34208,RESID:55@4,,,,,,1
22443,Q06185,ATP synthase subunit e; mitochondrial,MVPPVQVSPLIKFGRYSALIIGMAYGAKRYSYLKPRAEEERRIAAEEKKRLDELKRIERELAEAQDDSILK,MVPPVQVSPLIKFGRYSALIIGMAYGAKRYSYLKPRAEEERRIAAEEKKRLDELKRIERELAEAQDDSILK,71,0,70,8272.47715969,8277.64218,,,PSI-MOD,1458,,,1
22448,Q9CQ75,NADH dehydrogenase [ubiquinone] 1 alpha subcomplex subunit 2,AAAAASRAVGAKLGLREIRVHLCQRSPGSQGVRDFIVQRYVELKKAHPNLPILIRECSEVQPKLWARYAFGQEKTVSLNNLSADEVTRAMQNVLSGKA,MAAAAASRAVGAKLGLREIRVHLCQRSPGSQGVRDFIVQRYVELKKAHPNLPILIRECSEVQPKLWARYAFGQEKTVSLNNLSADEVTRAMQNVLSGKA,98,1,98,10819.78730969,10826.51298,,,PSI-MOD,1458,,,1
22455,P01942,Hemoglobin subunit alpha,MVLSGEDKSNIKAAWGKIGGHGAEYGAEALERMFASFPTTKTYFPHFDVSHGSAQVKGHGKKVADALASAAGHLDDLPGALSALSDLHAHKLRVDPVNFKLLSHCLLVTLASHHPADFTPAVHASLDKFLASVSTVLTSKYR,MVLSGEDKSNIKAAWGKIGGHGAEYGAEALERMFASFPTTKTYFPHFDVSHGSAQVKGHGKKVADALASAAGHLDDLPGALSALSDLHAHKLRVDPVNFKLLSHCLLVTLASHHPADFTPAVHASLDKFLASVSTVLTSKYR,142,0,141,15075.76030469,15085.17628,,,,,,,1
22462,Q64433,10 kDa heat shock protein; mitochondrial,AGQAFRKFLPLFDRVLVERSAAETVTKGGIMLPEKSQGKVLQATVVAVGSGGKGKSGEIEPVSVKVGDKVLLPEYGGTKVVLDDKDYFLFRDSDILGKYVD,MAGQAFRKFLPLFDRVLVERSAAETVTKGGIMLPEKSQGKVLQATVVAVGSGGKGKSGEIEPVSVKVGDKVLLPEYGGTKVVLDDKDYFLFRDSDILGKYVD,101,1,101,10966.85160369,10973.62038,RESID:55@6|RESID:545@26,,,,,,1
22473,P08228,Superoxide dismutase [Cu-Zn],AMKAVCVLKGDGPVQGTIHFEQKASGEPVVLSGQITGLTEGQHGFHVHQYGDNTQGCTSAGPHFNPHSKKHGGPADEERHVGDLGNVTAGKDGVANVSIEDRVISLSGEHSIIGRTMVVHEKQDDLGKGGNEESTKTGNAGSRLACGVIGIAQ,MAMKAVCVLKGDGPVQGTIHFEQKASGEPVVLSGQITGLTEGQHGFHVHQYGDNTQGCTSAGPHFNPHSKKHGGPADEERHVGDLGNVTAGKDGVANVSIEDRVISLSGEHSIIGRTMVVHEKQDDLGKGGNEESTKTGNAGSRLACGVIGIAQ,153,1,153,15885.78554469,15895.55898,RESID:55@135,,PSI-MOD,1458,,,1
22477,Q9D855,Cytochrome b-c1 complex subunit 7,AGRSAVSASSKWLDGFRKWYYNAAGFNKLGLMRDDTLHETEDVKEAIRRLPEDLYNDRMLRIKRALDLTMRHQILPKDQWTKYEEDKFYLEPYLKEVIRERKEREEWAKK,MAGRSAVSASSKWLDGFRKWYYNAAGFNKLGLMRDDTLHETEDVKEAIRRLPEDLYNDRMLRIKRALDLTMRHQILPKDQWTKYEEDKFYLEPYLKEVIRERKEREEWAKK,110,1,110,13429.92522969,13438.31878,,,PSI-MOD,1458,,,1
22480,Q9CPX8,Cytochrome b-c1 complex subunit 10,MLSRFLGPRYRELARNWIPTAGMWGTVGAVGLVWATDWRLILDWVPYINGKFKKDD,MLSRFLGPRYRELARNWIPTAGMWGTVGAVGLVWATDWRLILDWVPYINGKFKKDD,56,0,55,6576.42950969,6580.68418,,,PSI-MOD,1458,,,1
22484,P62806,Histone H4,SGRGKGGKGLGKGGAKRHRKVLRDNIQGITKPAIRRLARRGGVKRISGLIYEETRGVLKVFLENVIRDAVTYTEHAKRKTVTAMDVVYALKRQGRTLYGFGG,MSGRGKGGKGLGKGGAKRHRKVLRDNIQGITKPAIRRLARRGGVKRISGLIYEETRGVLKVFLENVIRDAVTYTEHAKRKTVTAMDVVYALKRQGRTLYGFGG,102,1,102,11341.39344469,11348.28188,RESID:67@2|RESID:55@7|RESID:55@11,,,,,,1
22485,P08228,Superoxide dismutase [Cu-Zn],AMKAVCVLKGDGPVQGTIHFEQKASGEPVVLSGQITGLTEGQHGFHVHQYGDNTQGCTSAGPHFNPHSKKHGGPADEERHVGDLGNVTAGKDGVANVSIEDRVISLSGEHSIIGRTMVVHEKQDDLGKGGNEESTKTGNAGSRLACGVIGIAQ,MAMKAVCVLKGDGPVQGTIHFEQKASGEPVVLSGQITGLTEGQHGFHVHQYGDNTQGCTSAGPHFNPHSKKHGGPADEERHVGDLGNVTAGKDGVANVSIEDRVISLSGEHSIIGRTMVVHEKQDDLGKGGNEESTKTGNAGSRLACGVIGIAQ,153,1,153,15843.77497969,15853.51898,,,PSI-MOD,1458,,,1
22488,P01942,Hemoglobin subunit alpha,VLSGEDKSNIKAAWGKIGGHGAEYGAEALERMFASFPTTKTYFPHFDVSHGSAQVKGHGKKVADALASAAGHLDDLPGALSALSDLHAHKLRVDPVNFKLLSHCLLVTLASHHPADFTPAVHASLDKFLASVSTVLTSKYR,MVLSGEDKSNIKAAWGKIGGHGAEYGAEALERMFASFPTTKTYFPHFDVSHGSAQVKGHGKKVADALASAAGHLDDLPGALSALSDLHAHKLRVDPVNFKLLSHCLLVTLASHHPADFTPAVHASLDKFLASVSTVLTSKYR,141,1,141,14944.71981469,14953.98368,,,,,,,1
22489,Q64433,10 kDa heat shock protein; mitochondrial,MAGQAFRKFLPLFDRVLVERSAAETVTKGGIMLPEKSQGKVLQATVVAVGSGGKGKSGEIEPVSVKVGDKVLLPEYGGTKVVLDDKDYFLFRDSDILGKYVD,MAGQAFRKFLPLFDRVLVERSAAETVTKGGIMLPEKSQGKVLQATVVAVGSGGKGKSGEIEPVSVKVGDKVLLPEYGGTKVVLDDKDYFLFRDSDILGKYVD,102,0,101,10997.87604969,11004.74298,RESID:55@7,,,,,,1
22492,Q9CQC7,NADH dehydrogenase [ubiquinone] 1 beta subcomplex subunit 4,SGSKYKPAPLATLPSTLDPAEYDVSPETRRAQVERLSIRARLKREYLLQYNDPKRVSHIEDPALIRWTYARSANIYPNFRPTPKNSLLGAVAGFGPLIFWYYVFKTDRDRKERLIQEGKLDRKFNISY,MSGSKYKPAPLATLPSTLDPAEYDVSPETRRAQVERLSIRARLKREYLLQYNDPKRVSHIEDPALIRWTYARSANIYPNFRPTPKNSLLGAVAGFGPLIFWYYVFKTDRDRKERLIQEGKLDRKFNISY,128,1,128,14982.95431969,14992.13808,,,PSI-MOD,1458,,,1
22502,P48771,Cytochrome c oxidase subunit 7A2; mitochondrial,FENKVPEKQKLFQEDNGMPVHLKGGASDALLYRATMALTLGGTAYAIYLLAMAAFPKKQN,MLRNLLALRQIAQRTISTTSRRHFENKVPEKQKLFQEDNGMPVHLKGGASDALLYRATMALTLGGTAYAIYLLAMAAFPKKQN,60,23,82,6610.42177969,6614.70338,RESID:55@9,,,,,,1
22509,P08228,Superoxide dismutase [Cu-Zn],AMKAVCVLKGDGPVQGTIHFEQKASGEPVVLSGQITGLTEGQHGFHVHQYGDNTQGCTSAGPHFNPHSKKHGGPADEERHVGDLGNVTAGKDGVANVSIEDRVISLSGEHSIIGRTMVVHEKQDDLGKGGNEESTKTGNAGSRLACGVIGIAQ,MAMKAVCVLKGDGPVQGTIHFEQKASGEPVVLSGQITGLTEGQHGFHVHQYGDNTQGCTSAGPHFNPHSKKHGGPADEERHVGDLGNVTAGKDGVANVSIEDRVISLSGEHSIIGRTMVVHEKQDDLGKGGNEESTKTGNAGSRLACGVIGIAQ,153,1,153,15943.79102369,15953.58898,RESID:545@135,,PSI-MOD,1458,,,1
22511,Q9DB10,Essential MCU regulator; mitochondrial,VIVTRSGAILPKPVKMSFGLLRVFSIVIPFLYVGTLISKNFAALLEEHDIFVPEDDDDDD,MASTAARRLAWVAVRPGALWSGPRGRRGGDVYTVPGSSGLSQVPSRSVIVTRSGAILPKPVKMSFGLLRVFSIVIPFLYVGTLISKNFAALLEEHDIFVPEDDDDDD,60,47,106,6673.54360469,6677.75808,,,,,,,1
22516,Q64433,10 kDa heat shock protein; mitochondrial,MAGQAFRKFLPLFDRVLVERSAAETVTKGGIMLPEKSQGKVLQATVVAVGSGGKGKSGEIEPVSVKVGDKVLLPEYGGTKVVLDDKDYFLFRDSDILGKYVD,MAGQAFRKFLPLFDRVLVERSAAETVTKGGIMLPEKSQGKVLQATVVAVGSGGKGKSGEIEPVSVKVGDKVLLPEYGGTKVVLDDKDYFLFRDSDILGKYVD,102,0,101,10955.86548469,10962.70298,,,,,,,1
22518,Q9CPQ3,Mitochondrial import receptor subunit TOM22 homolog,AAAVAAAGAGEPLSPEELLPKAEAEKAEEELEEDDDDELDETLSERLWGLTEMFPERVRSAAGATFDLSLFVAQKMYRFSRAALWIGTTSFMILVLPVVFETEKLQMEQQQQLQQRQILLGPNTGLSGGMPGALPPLPGKM,MAAAVAAAGAGEPLSPEELLPKAEAEKAEEELEEDDDDELDETLSERLWGLTEMFPERVRSAAGATFDLSLFVAQKMYRFSRAALWIGTTSFMILVLPVVFETEKLQMEQQQQLQQRQILLGPNTGLSGGMPGALPPLPGKM,141,1,141,15437.77268969,15447.58148,,,PSI-MOD,1458,,,1
22538,Q9CQ75,NADH dehydrogenase [ubiquinone] 1 alpha subcomplex subunit 2,MAAAAASRAVGAKLGLREIRVHLCQRSPGSQGVRDFIVQRYVELKKAHPNLPILIRECSEVQPKLWARYAFGQEKTVSLNNLSADEVTRAMQNVLSGKA,MAAAAASRAVGAKLGLREIRVHLCQRSPGSQGVRDFIVQRYVELKKAHPNLPILIRECSEVQPKLWARYAFGQEKTVSLNNLSADEVTRAMQNVLSGKA,99,0,98,10908.81723469,10915.66558,,,,,,,1